{"text_format":"1","workbook":"xlsx","n_sheets":2,"sheets":["PT","Hoja1"],"not_rendered":{"charts":0,"images":1,"macros":1,"external_links":0,"defined_names":4,"comments":0,"pivot_tables":0},"unopened":[],"bounds":{"document_bytes":16777216,"sheet_cells":100000,"rows_first":2000,"rows_last":500,"rows_between":2000,"halvings":0,"cell_chars":16384,"cell_head_chars":4096},"cells_cut":0,"cells_raw":0,"read":"whole","date_system":"1900"}

{"sheet":"PT","index":0,"n_rows":76,"n_cols":17,"rows_kept":76,"cut":false,"hidden":false,"merged":[[27,12,27,17],[28,12,67,17],[72,13,72,16],[32,2,32,4],[43,2,43,4],[44,2,44,4],[45,2,45,4],[46,2,46,4],[47,2,47,4],[48,2,48,4],[49,2,49,4],[50,2,50,4],[51,2,51,4],[52,2,52,4],[40,2,40,4],[41,2,41,4],[42,2,42,4],[37,2,37,4],[38,2,38,4],[33,2,33,4],[34,2,34,4],[35,2,35,4],[36,2,36,4],[39,2,39,4],[27,2,27,4],[28,2,28,4],[29,2,29,4],[30,2,30,4],[31,2,31,4],[78,8,78,11],[4,6,4,17],[24,11,26,11],[13,5,13,17],[15,5,15,6],[23,5,26,5],[24,6,26,6],[24,7,26,7],[23,12,23,17],[75,4,75,5],[68,6,68,17],[24,10,26,10],[24,8,26,8],[71,8,71,11],[71,13,71,16],[73,8,74,11],[5,7,5,17],[24,12,24,17],[25,12,25,17],[26,12,26,17],[16,13,17,13],[16,12,17,12],[8,2,8,17],[20,2,21,17],[23,2,26,4],[7,2,7,3],[24,9,26,9],[15,9,15,10],[15,12,15,13],[10,13,10,17],[23,6,23,11],[53,2,53,4],[54,2,54,4],[55,2,55,4],[56,2,56,4],[57,2,57,4],[58,2,58,4],[75,13,75,16],[59,2,59,4],[65,2,65,4],[66,2,66,4],[67,2,67,4],[60,2,60,4],[61,2,61,4],[62,2,62,4],[63,2,63,4],[64,2,64,4],[73,3,74,6],[73,13,74,16],[72,8,72,11],[71,3,71,6],[72,3,72,6]]}
[]
[]
[]
[]
[null,null,null,null,null,null,{"$f":"IFERROR(VLOOKUP($M$26,Hoja1!$D$2:$E$4,2,FALSE),\"\")","v":"PAGO A TERCEROS"}]
[]
[]
[null,null,"RVA:"]
[null,null,"DATOS DEL DOCUMENTO"]
[]
[null,null,null,null,"RELACIÓN DE",1,"DOCUMENTOS QUE AMPARAN UN IMPORTE TOTAL DE:  ",null,null,null,null,null,null,{"$f":"$F$69","v":0}]
[null,null,null,null,"QUE SE ENVÍAN PARA SU REVISIÓN Y TRÁMITE."]
[]
[null,null,null,null,{"$f":"IFERROR(VLOOKUP(M26,Hoja1!D2:H4,5,FALSE),\"\")","v":"BENEFICIARIO (A):"}]
[]
[null,null,null,null,"R.F.C.:"]
[]
[null,null,null,null,null,null,null,null,null,null,null,null,null,null,null,"FECHA","FOLIO"]
[]
[null,null,null,null,null,null,null,null,null,null,null,null,null,null,null," "]
[null,null,"REFERENCIA AL DOCUMENTO"]
[]
[]
[null,null,"COMPROBANTE    NO.",null,null,"IMPORTE","ESTRUCTURA PROGRAMÁTICA",null,null,null,null,null,"OBSERVACIONES"]
[null,null,null,null,null,null,"RAMO","UR","PROYECTO","A FUNC","FONDO","PARTIDA","TIPO DE TRAMITE"]
[null,null,null,null,null,null,null,null,null,null,null,null,"PAGO A TERCEROS"]
[null,null,null,null,null,null,null,null,null,null,null,null,"SUBSECRETARÍA DE ADMINISTRACIÓN Y FINANZAS SEG"]
[null,null,null,null,null,null,null,null,null,null,null,null,"JUSTIFICACIÓN"]
[]
[]
[]
[]
[]
[]
[]
[]
[]
[]
[]
[]
[]
[]
[]
[]
[]
[]
[]
[]
[]
[]
[]
[]
[]
[]
[]
[]
[]
[]
[]
[]
[]
[]
[]
[]
[]
[]
[]
[]
[null,null,null,null,"TOTAL           ",{"$f":"SUM(F28:F68)","v":0},{"$f":"PesosMN(F69)","v":"( PESO 00/100 M.N.)"}]
[]
[]
[null,null,null,"Titular de UR (1)",null,null,null,null,"REVISÓ",null,null,null,null,"A U T O R I Z Ó"]
[]
[null,null,null,null,null,null,null,null,{"$f":"IFERROR(VLOOKUP($M$26,Hoja1!$D$2:$G$4,3,FALSE),\"\")","v":"C.P. Adán Sánchez Sánchez\nDirector General de Presupuesto y Finanzas"},null,null,null,null,{"$f":"IFERROR(VLOOKUP($M$26,Hoja1!$D$2:$G$4,4,FALSE),\"\")","v":"Ing. Alejandro González Ruiz\nSubsecretario de Administración y Finanzas\n"}]
[]
[null,null,null,null,"1.- Valida la afectación y ejercicio del presupuesto asignado de conformidad a lo establecido en el Artículo 77 de Ley del Presupuesto General de Egresos del Estado de Guanajuato."]

{"sheet":"Hoja1","index":1,"n_rows":328,"n_cols":8,"rows_kept":328,"cut":false,"hidden":true,"merged":[[6,1,6,3],[6,5,6,6],[6,10,6,12]]}
[]
[null,"PAGO A TERCEROS",null,"PAGO A TERCEROS","PAGO A TERCEROS","C.P. Adán Sánchez Sánchez\nDirector General de Presupuesto y Finanzas","Ing. Alejandro González Ruiz\nSubsecretario de Administración y Finanzas\n","BENEFICIARIO (A):"]
[null,"GASTOS DE OPERACIÓN",null,"FONDO REVOLVENTE","FONDO REVOLVENTE","C.P. Adán Sánchez Sánchez\nDirector General de Presupuesto y Finanzas","Ing. Alejandro González Ruiz\nSubsecretario de Administración y Finanzas\n","A FAVOR DE:"]
[null,null,null,"COMPROBACIÓN DE GASTOS A RESERVA","COMPROBACIÓN DE GASTOS A RESERVA","C.P. Adán Sánchez Sánchez\nDirector General de Presupuesto y Finanzas","Ing. Alejandro González Ruiz\nSubsecretario de Administración y Finanzas\n","A FAVOR DE:"]
[]
[]
[null,"UR"]
[null,null,null,"DESPACHO DE LA PERSONA TITULAR DE LA SEG"]
[null,null,null,"DIR GRAL MENTEFACTURA Y PROYECTOS ESPECIALES SEG"]
[null,null,null,"DIR GRAL DE POLÍTICA EDUCATIVA SEG"]
[null,null,null,"DIRECCIÓN GENERAL JURÍDICA SEG"]
[null,null,null,"COORDINACIÓN DE COMUNICACIÓN ESTRATÉGICA SEG"]
[null,null,null,"SUBSECRETARÍA DE ADMINISTRACIÓN Y FINANZAS SEG"]
[null,null,null,"DIRECCIÓN GENERAL DE NÓMINA SEG"]
[null,null,null,"DIR GRAL DE DESARROLLO DE PERSONAL SEG"]
[null,null,null,"DIR GRAL RECURSOS MATERIALES Y SERVICIOS GENERALES SEG"]
[null,null,null,"DIRECCION GENERAL DE PRESUPUESTO Y FINANZAS SEG"]
[null,null,null,"SUBSECRETARÍA DE EDUCACIÓN BÁSICA SEG"]
[null,null,null,"DIRECCIÓN GENERAL EDUCACIÓN BÁSICA SEG"]
[null,null,null,"DIR GRAL PARA EL DESARROLLO INTEGRAL DE LA COMUNIDAD EDUCATIVA SEG"]
[null,null,null,"DIRECCIÓN TRANSVERSAL PARA LA CONVIVENCIA Y CULTURA DE LA PAZ SEG"]
[null,null,null,"SUBSECRETARIA DE EDUCACIÓN MEDIA SUPERIOR Y SUPERIOR SEG"]
[null,null,null,"DIRECCIÓN GENERAL DE EDUCACIÓN MEDIA SUPERIOR SEG"]
[null,null,null,"DIRECCIÓN GENERAL DE EDUCACIÓN SUPERIOR SEG"]
[null,null,null,"DIRECCIÓN GENERAL COBER PROFES EDUC MEDIA SUPERIOR Y SUPERIOR SEG"]
[null,null,null,"DELEGACIÓN REGIONAL EDUCACIÓN I DOLORES HIDALGO SEG"]
[null,null,null,"DELEGACIÓN REGIONAL EDUCACIÓN II SAN LUIS DE LA PAZ SEG"]
[null,null,null,"DELEGACIÓN REGIONAL EDUCACIÓN III LEÓN SEG"]
[null,null,null,"DELEGACIÓN REGIONAL EDUCACIÓN IV IRAPUATO SEG"]
[null,null,null,"DELEGACIÓN REGIONAL EDUCACIÓN V CELAYA SEG"]
[null,null,null,"DELEGACIÓN REGIONAL EDUCACIÓN VI ABASOLO SEG"]
[null,null,null,"DELEGACIÓN REGIONAL EDUCACIÓN VII ACÁMBARO SEG"]
[null,null,null,"ÓRGANO INTERNO DE CONTROL SEG"]
[null,null,null,"ESCUELA NORMAL DE IRAPUATO (ENOI) SEG"]
[null,null,null,"ESCUELA NORMAL DE LEÓN (ENOL) SEG"]
[null,null,null,"ESCUELA NORMAL SUPERIOR OFICIAL GTO (ENSOG) SEG"]
[null,null,null,"CENTRO DE ESTUDIOS SUPERIOR DE EDUCACIÓN ESPECIALIZADA (CESEE) SEG"]
[null,null,null,"BENEMÉRITA Y CENTENARIA ESCUELA NORMAL OFICIAL GTO (BCENOG) SEG"]
[null,null,null,"CENTRO DE ACTUALIZACIÓN MAGISTERIAL GTO SEG"]
[null,null,null,"CENTRO DE ACTUALIZACIÓN MAGISTERIAL CELAYA SEG"]
[null,null,null,"UNIVERSIDAD PEDAGÓGICA NACIONAL CELAYA SEG"]
[null,null,null,"UNIVERSIDAD PEDAGÓGICA NACIONAL LEÓN SEG"]
[null,null,null,"UNIVERSIDAD PEDAGÓGICA NACIONAL GTO SEG"]
[null,null,null,"VARIAS"]
[]
[]
[]
[]
[]
[]
[]
[]
[]
[]
[]
[]
[]
[]
[]
[]
[]
[]
[]
[]
[]
[]
[]
[]
[]
[]
[]
[]
[]
[]
[]
[]
[]
[]
[]
[]
[]
[]
[]
[]
[]
[]
[]
[]
[]
[]
[]
[]
[]
[]
[]
[]
[]
[]
[]
[]
[]
[]
[]
[]
[]
[]
[]
[]
[]
[]
[]
[]
[]
[]
[]
[]
[]
[]
[]
[]
[]
[]
[]
[]
[]
[]
[]
[]
[]
[]
[]
[]
[]
[]
[]
[]
[]
[]
[]
[]
[]
[]
[]
[]
[]
[]
[]
[]
[]
[]
[]
[]
[]
[]
[]
[]
[]
[]
[]
[]
[]
[]
[]
[]
[]
[]
[]
[]
[]
[]
[]
[]
[]
[]
[]
[]
[]
[]
[]
[]
[]
[]
[]
[]
[]
[]
[]
[]
[]
[]
[]
[]
[]
[]
[]
[]
[]
[]
[]
[]
[]
[]
[]
[]
[]
[]
[]
[]
[]
[]
[]
[]
[]
[]
[]
[]
[]
[]
[]
[]
[]
[]
[]
[]
[]
[]
[]
[]
[]
[]
[]
[]
[]
[]
[]
[]
[]
[]
[]
[]
[]
[]
[]
[]
[]
[]
[]
[]
[]
[]
[]
[]
[]
[]
[]
[]
[]
[]
[]
[]
[]
[]
[]
[]
[]
[]
[]
[]
[]
[]
[]
[]
[]
[]
[]
[]
[]
[]
[]
[]
[]
[]
[]
[]
[]
[]
[]
[]
[]
[]
[]
[]
[]
[]
[]
[]
[]
[]
[]
[]
[]
[]
[]
[]
[]
[]
[]
[]
[]
[]
[]
[]
[]
[]
[]
[]
[]
[]
[]
[]
[]
[]
[]
[]
[]
[]
[]
[null,null,null,null,null,null,"VARIOS"]