{"text_format":"1","workbook":"xlsx","n_sheets":2,"sheets":["PT","Hoja1"],"not_rendered":{"charts":0,"images":1,"macros":1,"external_links":0,"defined_names":2,"comments":0,"pivot_tables":0},"unopened":[],"bounds":{"document_bytes":16777216,"sheet_cells":100000,"rows_first":2000,"rows_last":500,"rows_between":2000,"halvings":0,"cell_chars":16384,"cell_head_chars":4096},"cells_cut":0,"cells_raw":0,"read":"whole","date_system":"1900"}

{"sheet":"PT","index":0,"n_rows":77,"n_cols":92,"rows_kept":77,"cut":false,"hidden":false,"merged":[[65,1,65,2],[53,1,53,2],[54,1,54,2],[58,1,58,2],[59,1,59,2],[60,1,60,2],[34,1,34,2],[61,1,61,2],[62,1,62,2],[63,1,63,2],[64,1,64,2],[4,4,4,14],[8,1,8,14],[14,3,14,14],[16,3,16,4],[10,11,10,14],[14,1,14,2],[16,1,16,2],[7,2,7,3],[74,1,75,3],[24,4,24,9],[69,4,69,14],[25,6,27,6],[24,3,27,3],[25,4,27,4],[25,5,27,5],[27,10,27,14],[28,10,28,14],[25,7,27,7],[25,8,27,8],[35,1,35,2],[36,1,36,2],[37,1,37,2],[44,1,44,2],[45,1,45,2],[73,1,73,3],[73,6,73,9],[73,11,73,13],[46,1,46,2],[47,1,47,2],[55,1,55,2],[56,1,56,2],[57,1,57,2],[48,1,48,2],[49,1,49,2],[50,1,50,2],[51,1,51,2],[52,1,52,2],[68,1,68,2],[29,10,68,14],[66,1,66,2],[21,1,22,14],[24,10,24,14],[72,1,72,3],[72,6,72,9],[72,11,72,13],[25,9,27,9],[25,10,25,14],[26,10,26,14],[24,1,27,2],[28,1,28,2],[29,1,29,2],[30,1,30,2],[31,1,31,2],[32,1,32,2],[67,1,67,2],[33,1,33,2],[75,6,75,9],[74,11,74,13],[75,11,75,13],[74,6,74,9],[79,6,79,9],[76,11,76,13]]}
[]
[]
[]
[]
[null,null,null,null,{"$f":"IFERROR(VLOOKUP($K$27,Hoja1!$D$2:$E$4,2,FALSE),\"\")","v":"PAGO A TERCEROS"}]
[]
[]
[null,"RVA: "]
[null,"DATOS DEL DOCUMENTO"]
[]
[null,"         RELACIÓN DE",null,"DOCUMENTOS QUE AMPARAN UN IMPORTE TOTAL DE:  ",null,null,null,null,null,null,null,{"$f":"$D$70","v":0}]
[null,"        QUE SE ENVÍAN PARA SU REVISIÓN Y TRÁMITE."]
[]
[]
[null,{"$f":"IFERROR(VLOOKUP(K27,Hoja1!D2:H4,5,FALSE),\"\")","v":"BENEFICIARIO (A):"}]
[]
[null,"R.F.C.:"]
[]
[null,null,null,null,null,null,null,null,null,null,null,null,"FECHA","FOLIO"]
[]
[null,null,null,null,null,null,null,null,null,null,null,null," ",null,null,null,null,null,null,null,null,null,null,null,null,null,null,null,null,null,null,null,null,null,null,null,null,null,null,null,null,null,null,null,null,null,null,null,null,null,null,null,null,null,null,null,null,null,null,null,null,null,null,null,null,null,null,null,null,null,null,null,null,null,null,null,null,null,null,null,null,null,null,null,null,null,null,null,null,null,null,"DELEGACIÓN REGIONAL EDUCACIÓN I DOLORES HIDALGO SEG"]
[null,"REFERENCIA AL DOCUMENTO",null,null,null,null,null,null,null,null,null,null,null,null,null,null,null,null,null,null,null,null,null,null,null,null,null,null,null,null,null,null,null,null,null,null,null,null,null,null,null,null,null,null,null,null,null,null,null,null,null,null,null,null,null,null,null,null,null,null,null,null,null,null,null,null,null,null,null,null,null,null,null,null,null,null,null,null,null,null,null,null,null,null,null,null,null,null,null,null,null,"DELEGACIÓN REGIONAL EDUCACIÓN II SAN LUIS DE LA PAZ SEG"]
[null,null,null,null,null,null,null,null,null,null,null,null,null,null,null,null,null,null,null,null,null,null,null,null,null,null,null,null,null,null,null,null,null,null,null,null,null,null,null,null,null,null,null,null,null,null,null,null,null,null,null,null,null,null,null,null,null,null,null,null,null,null,null,null,null,null,null,null,null,null,null,null,null,null,null,null,null,null,null,null,null,null,null,null,null,null,null,null,null,null,null,"DELEGACIÓN REGIONAL EDUCACIÓN III LEÓN SEG"]
[null,null,null,null,null,null,null,null,null,null,null,null,null,null,null,null,null,null,null,null,null,null,null,null,null,null,null,null,null,null,null,null,null,null,null,null,null,null,null,null,null,null,null,null,null,null,null,null,null,null,null,null,null,null,null,null,null,null,null,null,null,null,null,null,null,null,null,null,null,null,null,null,null,null,null,null,null,null,null,null,null,null,null,null,null,null,null,null,null,null,null,"DELEGACIÓN REGIONAL EDUCACIÓN IV IRAPUATO SEG"]
[null,"COMPROBANTE    NO.",null,"IMPORTE","ESTRUCTURA PROGRAMÁTICA",null,null,null,null,null,"OBSERVACIONES",null,null,null,null,null,null,null,null,null,null,null,null,null,null,null,null,null,null,null,null,null,null,null,null,null,null,null,null,null,null,null,null,null,null,null,null,null,null,null,null,null,null,null,null,null,null,null,null,null,null,null,null,null,null,null,null,null,null,null,null,null,null,null,null,null,null,null,null,null,null,null,null,null,null,null,null,null,null,null,null,"DELEGACIÓN REGIONAL EDUCACIÓN V CELAYA SEG"]
[null,null,null,null,"RAMO","UR","PROYECTO","A FUNC","FONDO","PARTIDA","TIPO DE TRAMITE",null,null,null,null,null,null,null,null,null,null,null,null,null,null,null,null,null,null,null,null,null,null,null,null,null,null,null,null,null,null,null,null,null,null,null,null,null,null,null,null,null,null,null,null,null,null,null,null,null,null,null,null,null,null,null,null,null,null,null,null,null,null,null,null,null,null,null,null,null,null,null,null,null,null,null,null,null,null,null,null,"DELEGACIÓN REGIONAL EDUCACIÓN VI ABASOLO SEG"]
[null,null,null,null,null,null,null,null,null,null,"PAGO A TERCEROS",null,null,null,null,null,null,null,null,null,null,null,null,null,null,null,null,null,null,null,null,null,null,null,null,null,null,null,null,null,null,null,null,null,null,null,null,null,null,null,null,null,null,null,null,null,null,null,null,null,null,null,null,null,null,null,null,null,null,null,null,null,null,null,null,null,null,null,null,null,null,null,null,null,null,null,null,null,null,null,null,"DELEGACIÓN REGIONAL EDUCACIÓN VII ACÁMBARO SEG"]
[null,null,null,null,null,null,null,null,null,null,"CENTRO ACTUALIZACIÓN MAGISTERIAL GTO SEG",null,null,null,null,null,null,null,null,null,null,null,null,null,null,null,null,null,null,null,null,null,null,null,null,null,null,null,null,null,null,null,null,null,null,null,null,null,null,null,null,null,null,null,null,null,null,null,null,null,null,null,null,null,null,null,null,null,null,null,null,null,null,null,null,null,null,null,null,null,null,null,null,null,null,null,null,null,null,null,null,"ESCUELA NORMAL DE IRAPUATO (ENOI) SEG"]
[null,null,null,null,null,null,null,null,null,null,"JUSTIFICACION",null,null,null,null,null,null,null,null,null,null,null,null,null,null,null,null,null,null,null,null,null,null,null,null,null,null,null,null,null,null,null,null,null,null,null,null,null,null,null,null,null,null,null,null,null,null,null,null,null,null,null,null,null,null,null,null,null,null,null,null,null,null,null,null,null,null,null,null,null,null,null,null,null,null,null,null,null,null,null,null,"ESCUELA NORMAL DE LEÓN (ENOL) SEG"]
[null,null,null,null,null,null,null,null,null,null,null,null,null,null,null,null,null,null,null,null,null,null,null,null,null,null,null,null,null,null,null,null,null,null,null,null,null,null,null,null,null,null,null,null,null,null,null,null,null,null,null,null,null,null,null,null,null,null,null,null,null,null,null,null,null,null,null,null,null,null,null,null,null,null,null,null,null,null,null,null,null,null,null,null,null,null,null,null,null,null,null,"ESC NORMAL SUP OFICIAL GTO (ENSOG) SEG"]
[null,null,null,null,null,null,null,null,null,null,null,null,null,null,null,null,null,null,null,null,null,null,null,null,null,null,null,null,null,null,null,null,null,null,null,null,null,null,null,null,null,null,null,null,null,null,null,null,null,null,null,null,null,null,null,null,null,null,null,null,null,null,null,null,null,null,null,null,null,null,null,null,null,null,null,null,null,null,null,null,null,null,null,null,null,null,null,null,null,null,null,"CTRO ESTU SUP EDUC ESPECIALIZA CESEE SEG"]
[null,null,null,null,null,null,null,null,null,null,null,null,null,null,null,null,null,null,null,null,null,null,null,null,null,null,null,null,null,null,null,null,null,null,null,null,null,null,null,null,null,null,null,null,null,null,null,null,null,null,null,null,null,null,null,null,null,null,null,null,null,null,null,null,null,null,null,null,null,null,null,null,null,null,null,null,null,null,null,null,null,null,null,null,null,null,null,null,null,null,null,"BEN ESC NORMAL OFIC GTO (BCENOG) SEG"]
[null,null,null,null,null,null,null,null,null,null,null,null,null,null,null,null,null,null,null,null,null,null,null,null,null,null,null,null,null,null,null,null,null,null,null,null,null,null,null,null,null,null,null,null,null,null,null,null,null,null,null,null,null,null,null,null,null,null,null,null,null,null,null,null,null,null,null,null,null,null,null,null,null,null,null,null,null,null,null,null,null,null,null,null,null,null,null,null,null,null,null,"CENTRO ACTUALIZACIÓN MAGISTERIAL GTO SEG"]
[null,null,null,null,null,null,null,null,null,null,null,null,null,null,null,null,null,null,null,null,null,null,null,null,null,null,null,null,null,null,null,null,null,null,null,null,null,null,null,null,null,null,null,null,null,null,null,null,null,null,null,null,null,null,null,null,null,null,null,null,null,null,null,null,null,null,null,null,null,null,null,null,null,null,null,null,null,null,null,null,null,null,null,null,null,null,null,null,null,null,null,"CTRO ACTUALIZACIÓN MAGISTERIAL CELAY SEG"]
[null,null,null,null,null,null,null,null,null,null,null,null,null,null,null,null,null,null,null,null,null,null,null,null,null,null,null,null,null,null,null,null,null,null,null,null,null,null,null,null,null,null,null,null,null,null,null,null,null,null,null,null,null,null,null,null,null,null,null,null,null,null,null,null,null,null,null,null,null,null,null,null,null,null,null,null,null,null,null,null,null,null,null,null,null,null,null,null,null,null,null,"UNIVERSIDAD PEDAGÓGICA NAC CELAYA SEG"]
[null,null,null,null,null,null,null,null,null,null,null,null,null,null,null,null,null,null,null,null,null,null,null,null,null,null,null,null,null,null,null,null,null,null,null,null,null,null,null,null,null,null,null,null,null,null,null,null,null,null,null,null,null,null,null,null,null,null,null,null,null,null,null,null,null,null,null,null,null,null,null,null,null,null,null,null,null,null,null,null,null,null,null,null,null,null,null,null,null,null,null,"UNIVERSIDAD PEDAGÓGICA NACIONAL LEÓN SEG"]
[null,null,null,null,null,null,null,null,null,null,null,null,null,null,null,null,null,null,null,null,null,null,null,null,null,null,null,null,null,null,null,null,null,null,null,null,null,null,null,null,null,null,null,null,null,null,null,null,null,null,null,null,null,null,null,null,null,null,null,null,null,null,null,null,null,null,null,null,null,null,null,null,null,null,null,null,null,null,null,null,null,null,null,null,null,null,null,null,null,null,null,"UNIVERSIDAD PEDAGÓGICA NACIONAL GTO SEG"]
[]
[]
[]
[]
[]
[]
[]
[]
[]
[]
[]
[]
[]
[]
[]
[]
[]
[]
[]
[]
[]
[]
[]
[]
[]
[]
[]
[]
[]
[]
[]
[]
[null,"TOTAL           ",null,{"$f":"SUM(D29:D69)","v":0},{"$f":"PesosMN(D70)","v":"( PESO 00/100 M.N.)"}]
[]
[]
[null,"ELABORÓ",null,null,null,null,"REVISÓ",null,null,null,null,"A U T O R I Z Ó"]
[]
[]
[null,null,null,null,null,null,null,null,null,null,null,"Delegado y/o Director de IFPE"]
[null,null,null,null,null,null,null,null,null,null,null,"1.- Valida la afectación y ejercicio del presupuesto asignado de conformidad a lo establecido en el Artículo 77 de Ley del Presupuesto General de Egresos del Estado de Guanajuato."]

{"sheet":"Hoja1","index":1,"n_rows":4,"n_cols":8,"rows_kept":4,"cut":false,"hidden":true,"merged":[]}
[]
[null,"PAGO A TERCEROS",null,"PAGO A TERCEROS","PAGO A TERCEROS","Coordinador (a) Administrativo","Delegado (a) Regional","BENEFICIARIO (A):"]
[null,"GASTOS DE OPERACIÓN",null,"FONDO REVOLVENTE","FONDO REVOLVENTE","Jefe (a) de Recursos Financieros","Coordinador (a) Administrativo","A FAVOR DE:"]
[null,null,null,"COMPROBACIÓN DE GASTOS A RESERVA","COMPROBACIÓN DE GASTOS A RESERVA","Jefe (a) de Recursos Financieros","Coordinador (a) Administrativo","A FAVOR DE:"]